python自动化之如何利用allure生成测试报告

Allure测试报告框架帮助你轻松实现”高大上”报告展示。本文通过示例演示如何从0到1集成Allure测试框架。重点展示了如何将Allure集成到已有的自动化测试工程中、以及如何实现报表的优化展示。Allure非常强大,支持多种语言多种测试框架,无论是Java/Python还是Junit/TestNG,其他语言或者框架实现的流程和本文一致,具体配置参照各语言框架规范

安装

安装allure

Windows用户:

  • scoop install allure    (需要先下载并安装Scoop,该方法无需配置环境变量)

MAC用户:

  • 通过Homebrew进行自动安装
  • brew install allure   (如果Homebrew版本比较旧,需要先升级Homebrew,否则安装的allure版本也很老,可能会与Python插件不兼容)

手动安装:

下载后解压并配置环境变量

安装allure-pytest插件

  • pip install allure-pytest

allure常用特性

希望在报告中看到测试功能,子功能或场景,测试步骤,包括测试附加信息可以使用@feature,@story,@step,@attach

步骤:

  • import allure
  • 功能上加@allure.feature("功能名称")
  • 子功能上加@allure.story("子功能名称")
  • 步骤上加@allure.step("步骤细节")
  • @allure.attach("具体文本信息"),需要附加的信息,可以是数据,文本,图片,视频,网页
  • 如果只测试部分功能运行的时候可以加限制过滤:
    • pytest 文件名 --allure-features "需要运行的功能名称"

allure特性—feature/story

@allure.feature与@allure.store的关系

  • feature相当于一个功能,一个大的模块,将case分类到某个feature中,报告中在behaviore中显示,相当于testsuite
  • story相当于对应这个功能或者模块下的不同场景,分支功能,属于feature之下的结构,报告在features中显示,相当于testcase
  • feature与story类似于父与子关系

step特性

  • 测试过程中每个步骤,一般放在具体逻辑方法中
  • 可以放在关键步骤中,在报告中显示
  • 在app,web自动化测试中,建议每切换到一个新的页面当做一个step
  • 用法:
    • @allure.step() 只能以装饰器的形式放在类或方法上面
    • with allure.step():  可以放在测试用例方法里面,但测试步骤的代码需要被该语句包含

运行:

  在测试执行期间收集结果

  pytest [测试文件] -s -q --alluredir=./result --clean-alluredir

  • --alluredir这个选项,用于指定存储测试结果的路径
  • --clean-alluredir 这个选项用来清除之前生成的结果

查看测试报告:

  方法一:测试完成后查看实际报告,在线看报告,会直接打开默认浏览器展示当前报告

      allure serve ./result

  方法二:从结果生成报告,这是一个启动tomcat的服务,需要两个步骤

      生成报告:

          allure generate ./result -o ./report --clean   (注意:--clean用来清除之前已生成的报告)

      打开报告:

          allure open -h 127.0.0.1 -p 8883 ./report   (该方法直接生成一个tomcat服务,可远程访问)

举个例子:

有如下代码文件

#!/usr/bin/python
# -*- coding: UTF-8 -*-
"""
@author:chenshifeng
@file:test_allure.py
@time:2020/10/10
"""
import allure
import pytest

@allure.feature('登录模块')
class TestLogin():
    @allure.story('登录成功')
    @allure.title('登录成功标题')
    def test_login_sucess(self):
        with allure.step('步骤1:打开应用'):
            print('应用已打开')
        with allure.step('步骤2:进入登录页面'):
            print('登录页面已打开')
        with allure.step('步骤3:输入用户名和密码'):
            print('用户名和密码输入成功')
        print('登录测试用例:登录成功')

    @allure.story('登录成功')
    def test_login_sucess2(self):
        assert '1' == 1
        print('登录测试用例:登录成功')

    @allure.story('登录失败')
    def test_login_failure_a(self):
        print('登录测试用例:登录失败,用户名缺失')

    @allure.story('登录失败')
    def test_login_failure_b(self):
        print('登录测试用例:登录失败,密码缺失')

    @allure.story('登录失败')
    def test_login_failure_c(self):
        with allure.step('输入用户名'):
            print('已输入用户名')
        with allure.step('输入密码'):
            print('已输入密码')
        with allure.step('点击登录'):
            print('已点击登录')
        print('登录测试用例:登录失败,密码错误')

@allure.feature('搜索模块')
class TestSearch():
    def test_search1(self):
        print('搜索用例1')

    TEST_CASE_LINK = 'https://mirrors.huaweicloud.com/'
    @allure.testcase(TEST_CASE_LINK,'测试用例连接')
    def test_search2(self):
        print('搜索用例2')
    @allure.step('搜索步骤')
    def test_search3(self):
        print('搜索用例3')

依次执行命令: 

  pytest test_allure.py --alluredir=./result --clean-alluredir

  allure serve ./result

chenshifengdeMacBook-Pro:testcode chenshifeng$ pytest test_allure.py --alluredir=./result --clean-alluredir
============================================================================= test session starts =============================================================================
platform darwin -- Python 3.9.0, pytest-6.1.1, py-1.9.0, pluggy-0.13.1
rootdir: /Users/chenshifeng/MyCode/PythonCode/SFDSZL/test_pytest, configfile: pytest.ini
plugins: allure-pytest-2.8.18
collected 8 items                                                                                                                                                             

test_allure.py .F......                                                                                                                                                 [100%]

================================================================================== FAILURES ===================================================================================
________________________________________________________________________ TestLogin.test_login_sucess2 _________________________________________________________________________

self = <test_allure.TestLogin object at 0x7fef3d5cba90>

    @allure.story('登录成功')
    def test_login_sucess2(self):
>       assert '1' == 1
E       AssertionError: assert '1' == 1

test_allure.py:27: AssertionError
=========================================================================== short test summary info ===========================================================================
FAILED test_allure.py::TestLogin::test_login_sucess2 - AssertionError: assert '1' == 1
========================================================================= 1 failed, 7 passed in 0.07s =========================================================================
chenshifengdeMacBook-Pro:testcode chenshifeng$ allure serve ./result
Generating report to temp directory...
Report successfully generated to /var/folders/p0/3_7fwrvx6n3ftpfd4wjb01300000gn/T/7024790777193223986/allure-report
Starting web server...
2020-10-13 21:39:56.174:INFO::main: Logging initialized @6818ms to org.eclipse.jetty.util.log.StdErrLog
Server started at <http://192.168.12.100:58977/>. Press <Ctrl+C> to exit

生成的报告:

allure特性-testcase

关联测试用例(可以直接给测试用例的地址链接)

例子:

TEST_CASE_LINK = 'https://mirrors.huaweicloud.com/'
@allure.testcase(TEST_CASE_LINK,'测试用例连接')
def test_search(self):
    print('搜索用例')

按重要性级别进行一定范围测试

通常测试有P0、冒烟测试、验证上线测试。按重要性级别来执行的,比如上线要把主流程和重要模块都跑一遍,可通过以下方法解决

通过附加@pytest.mark标记

通过allure.feature,allure.story

也可以通过allure.severity来附加标记

  • 级别:
  • trivial:不重要,轻微缺陷(必输项无提示,或者提示不规范)
  • minor 不太重要,次要缺陷(界面错误与UI需求不符)
  • normal:正常问题,普通缺陷(数值计算错误)
  • critical:严重,临界缺陷(功能点缺失)
  • blocker:阻塞,中断缺陷(客户端程序无响应,无法执行下一步操作)

使用方法:

   在方法、函数和类上面加 @allure.severity(allure.severity_level.TRIVIAL)

执行:

   pytest -s -v 文件名 --allure-severities normal,critical

举例说明:

#!/usr/bin/python
# -*- coding: UTF-8 -*-
"""
@author:chenshifeng
@file:test_severity.py
@time:2020/10/11
"""
import allure
import pytest

# 不加任何标记,默认normal
def test_with_no_severity():
    pass

# trivial:不重要,轻微缺陷(必输项无提示,或者提示不规范)
@allure.severity(allure.severity_level.TRIVIAL)
def test_with_trivial_severity():
    pass

# minor 级别 不太重要,次要缺陷(界面错误与UI需求不符)
@allure.severity(allure.severity_level.MINOR)
def test_with_minor_severity():
    pass

# normal:正常问题,普通缺陷(数值计算错误)
@allure.severity(allure.severity_level.NORMAL)
def test_with_normal_severity():
    pass

# critical:严重,临界缺陷(功能点缺失)
@allure.severity(allure.severity_level.CRITICAL)
def test_with_ritical_severity():
    pass

# blocker:阻塞,中断缺陷(客户端程序无响应,无法执行下一步操作)
@allure.severity(allure.severity_level.BLOCKER)
def test_with_blocker_severity():
    pass

@allure.severity(allure.severity_level.NORMAL)
class TestClassWithNormalSeverity(object):

    # 不加任何标记,默认为同class级别
    def test_inside_with_normal_severity(self):
        pass

    # 重新设置了critical级别
    @allure.severity(allure.severity_level.CRITICAL)
    def test_inside_with_critical_severity(self):
        pass

执行:

chenshifengdeMacBook-Pro:testcode chenshifeng$ pytest test_severity.py --alluredir=./result --clean-alluredir -vs
============================================================================= test session starts =============================================================================
platform darwin -- Python 3.9.0, pytest-6.1.1, py-1.9.0, pluggy-0.13.1 -- /usr/local/bin/python3.9
cachedir: .pytest_cache
rootdir: /Users/chenshifeng/MyCode/PythonCode/SFDSZL/test_pytest, configfile: pytest.ini
plugins: allure-pytest-2.8.18
collected 8 items                                                                                                                                                             

test_severity.py::test_with_no_severity PASSED
test_severity.py::test_with_trivial_severity PASSED
test_severity.py::test_with_minor_severity PASSED
test_severity.py::test_with_normal_severity PASSED
test_severity.py::test_with_ritical_severity PASSED
test_severity.py::test_with_blocker_severity PASSED
test_severity.py::TestClassWithNormalSeverity::test_inside_with_normal_severity PASSED
test_severity.py::TestClassWithNormalSeverity::test_inside_with_critical_severity PASSED

============================================================================== 8 passed in 0.03s ==============================================================================
chenshifengdeMacBook-Pro:testcode chenshifeng$ allure serve ./result
Generating report to temp directory...
Report successfully generated to /var/folders/p0/3_7fwrvx6n3ftpfd4wjb01300000gn/T/17788207943997663035/allure-report
Starting web server...
2020-10-13 22:27:49.842:INFO::main: Logging initialized @6620ms to org.eclipse.jetty.util.log.StdErrLog
Server started at <http://192.168.12.100:59696/>. Press <Ctrl+C> to exit

终极用例:

百度搜索:

#!/usr/bin/python
# -*- coding: UTF-8 -*-
"""
@author:chenshifeng
@file:test_baidudemo.py
@time:2020/10/13
"""
import pytest
import allure
from selenium import webdriver
import time

@allure.testcase('https://www.github.com')
@allure.feature("百度搜索")
@pytest.mark.parametrize('test_data1',['allure','pytest','unittest'])
def test_steps_demo(test_data1):
    with allure.step('打开百度网页'):
        driver=webdriver.Chrome()
        driver.get('http://www.baidu.com')
        driver.maximize_window()
    with allure.step(f'输入搜索词:{test_data1}'):
        driver.find_element_by_id('kw').send_keys(test_data1)
        time.sleep(2)
        driver.find_element_by_id('su').click()
        time.sleep(2)
    with allure.step('保存图片'):
        driver.save_screenshot('./screenshot/baidu.png')
        allure.attach.file('./screenshot/baidu.png',attachment_type=allure.attachment_type.PNG)
    with allure.step('关闭浏览器'):
        driver.quit()

执行:

chenshifengdeMacBook-Pro:testcode chenshifeng$ pytest test_baidudemo.py --alluredir=./result --clean-alluredir -vs
============================================================================= test session starts =============================================================================
platform darwin -- Python 3.9.0, pytest-6.1.1, py-1.9.0, pluggy-0.13.1 -- /usr/local/bin/python3.9
cachedir: .pytest_cache
rootdir: /Users/chenshifeng/MyCode/PythonCode/SFDSZL/test_pytest, configfile: pytest.ini
plugins: allure-pytest-2.8.18
collected 3 items                                                                                                                                                             

test_baidudemo.py::test_steps_demo[allure] PASSED
test_baidudemo.py::test_steps_demo[pytest] PASSED
test_baidudemo.py::test_steps_demo[unittest] PASSED

============================================================================= 3 passed in 24.65s ==============================================================================
chenshifengdeMacBook-Pro:testcode chenshifeng$ allure serve ./result
Generating report to temp directory...
Report successfully generated to /var/folders/p0/3_7fwrvx6n3ftpfd4wjb01300000gn/T/18005664130273264423/allure-report
Starting web server...
2020-10-13 23:03:39.221:INFO::main: Logging initialized @7360ms to org.eclipse.jetty.util.log.StdErrLog
Server started at <http://192.168.12.100:60775/>. Press <Ctrl+C> to exit

报告:

总结

到此这篇关于python自动化之如何利用allure生成测试报告的文章就介绍到这了,更多相关python allure生成测试报告内容请搜索我们以前的文章或继续浏览下面的相关文章希望大家以后多多支持我们!

(0)

相关推荐

  • python实现报表自动化详解

    本篇文章将介绍: xlwt 常用功能 xlrd 常用功能 xlutils 常用功能 xlwt写Excel时公式的应用 xlwt写入特定目录(路径设置) xlwt Python语言中,写入Excel文件的扩展工具.可以实现指定表单.指定单元格的写入.支持excel03版到excel2013版.使用时请确保已经安装python环境 xlrd Python语言中,读取Excel的扩展工具.可以实现指定表单.指定单元格的读取.使用时请确保已经安装python环境. NOTICE: xlwt对Excel只

  • Python自动化运维和部署项目工具Fabric使用实例

    Fabric 是使用 Python 开发的一个自动化运维和部署项目的一个好工具,可以通过 SSH 的方式与远程服务器进行自动化交互,例如将本地文件传到服务器,在服务器上执行shell 命令. 下面给出一个自动化部署 Django 项目的例子 # -*- coding: utf-8 -*- # 文件名要保存为 fabfile.py from __future__ import unicode_literals from fabric.api import * # 登录用户和主机名: env.use

  • Python实现性能自动化测试竟然如此简单

    一.思考❓❔ 1.什么是性能自动化测试? 性能系统负载能力超负荷运行下的稳定性系统瓶颈自动化测试使用程序代替手工提升测试效率性能自动化使用代码模拟大批量用户让用户并发请求多页面多用户并发请求采集参数,统计系统负载能力生成报告 2.Python中的性能自动化测试库? locust库 使用Python使用代码来创建批量用户分布式可以在多台服务器上,进行分布式性能测试可伸缩性强稳定.应用广泛经得住各种场景下的考验基于web ui界面展示测试详情能测任何系统 二.基础操作

  • Python自动化测试工具Splinter简介和使用实例

    Splinter 快速介绍 官方网站:http://splinter.cobrateam.info/ 官方介绍: Splinter is an open source tool for testingweb applications using Python. It lets you automate browser actions, such asvisiting URLs and interacting with their items 特性:1.可以模拟浏览器行为,访问指定的URL,并且可

  • python自动化测试实例解析

    本文实例讲述了python自动化测试的过程,分享给大家供大家参考. 具体代码如下: import unittest ######################################################################## class RomanNumeralConverter(object): """converter the Roman Number""" #-----------------------

  • python自动化之如何利用allure生成测试报告

    Allure测试报告框架帮助你轻松实现"高大上"报告展示.本文通过示例演示如何从0到1集成Allure测试框架.重点展示了如何将Allure集成到已有的自动化测试工程中.以及如何实现报表的优化展示.Allure非常强大,支持多种语言多种测试框架,无论是Java/Python还是Junit/TestNG,其他语言或者框架实现的流程和本文一致,具体配置参照各语言框架规范 安装 安装allure Windows用户: scoop install allure    (需要先下载并安装Scoo

  • allure结合python生成测试报告教程

    百度搜索实例 一.代码结构 本案例来自于霍格沃兹测试学院<高薪测试成长图谱>.data.yml为数据管理文件,test_baidudemo.py为测试用例文件,文件结构如下: 创建data/data.yml文件,代码如下 - allure - pytest - unittest 创建test_baidudemo.py,代码如下 #!/usr/bin/env python # -*- coding: utf-8 -*- from __future__ import unicode_literal

  • 利用Python自动化生成爱豆日历详解

    目录 1.科普 2.爱豆日历 3.总结 本次内容有感于<Python编程快速上手-让繁琐工作自动化>. 根据书中的「处理Excel电子表格」章节内容,做出一份专属日历. 使用的模块为openpyxl,一个能读取和修改Excel电子表格的Pyhton模块. 实现自动化处理表格信息,摆脱无趣无味. 此外还有calendar模块,通过该模块生成日历信息. 最后利用openpyxl和calendar库,实现自动化生成爱豆日历. 1.科普 在进行代码操作前,简单对相关知识做个简单的学习. 一个Excel

  • 详解用Pytest+Allure生成漂亮的HTML图形化测试报告

    对于软件测试工作来说,测试报告是非常重要的工作产出.一个漂亮.清晰.格式规范.内容完整的测试报告,既能最大化我们的测试工作产出,又能够减少开发人员和测试人员的沟通成本. 本篇文章将介绍如何使用开源的测试报告生成框架Allure生成规范.格式统一.美观的测试报告. 通过这篇文章的介绍,你将能够: 将Allure与Pytest测试框架相结合: 如何定制化测试报告内容 执行测试之后,生成Allure格式的测试报告. 如何与Jenkins集成. 将测试环境信息展示到测试报告中. 1.Allure测试报告

  • Python自动化之批量生成含指定数据的word文档

    目录 一.需求说明 二.开始动手动脑 三.总结 一.需求说明 在平时工作当中,经常需要处理文件,特别是Word,处理Word时会遇一类比较常见的场景:文档中大部分文字固定不变,小部分内容需要修改. 这时我们会机械的重复打开.修改.保存文档等一系列操作,内容少还可勉强接受,内容一旦多了,心里难免会心浮气躁. 今天我要给大家介绍一个秘密武器-docxtpl开发包,有了这个只需写一份模板,其他的都交给电脑自己进行. 首先需要你的电脑安装好了Python环境,并且安装好了Python开发工具. 如果你还

  • Python自动化办公之Word文档的创建与生成

    目录 保存生成 word 生成标题 生成段落 添加图片 添加表格 分页 上几章节我们主要学习了如何读取文章,而主要任务是读取文档中的文本信息,也就是字符串,而图片本身是不可读的文件所以并没有去读取图片.从今天开始将学习如何通过 python 脚本来自动生成一个 word 文档. 保存生成 word 在学习如何生成一个 word 文档之前,我们来看看如何保存生成 word 文件,因为马上就会用到. 使用方法: document_obj.save(文件地址) ---> /home/demo.docx

  • python使用 HTMLTestRunner.py生成测试报告

    本文介绍了python使用 HTMLTestRunner.py生成测试报告 ,分享给大家,具体如下: HTMLTestRunner.py python 2版本 下载地址:http://tungwaiyip.info/software/HTMLTestRunner.html 使用时,先建立一个"PyDev Package",将下载下来的HTMLTestRunner.py文件拷贝在该目录下. 例子:testcase5_dynamic.py import unittest from dev.

  • python自动化生成IOS的图标

    本文实例为大家分享了python自动化生成IOS的图标,供大家参考,具体内容如下 每次上架之前都要生成十几个图片感觉无聊麻烦,考虑使用脚本处理 脚本使用python 和一部分shell 处理的,python部分主要是使用PIL库处理图片,和调用shell脚本,shell 主要是操作文件 #coding=utf-8 import os ,threading from PIL import Image import subprocess import json class ImgManager(ob

  • python利用itertools生成密码字典并多线程撞库破解rar密码

    脚本功能: 利用itertools生成密码字典(迭代器形式) 多线程并发从密码字典中取出密码进行验证 验证成功后把密码写入文件中保存 #!/usr/bin/env python # -*- coding: UTF-8 -*- # Author:Leslie-x import itertools as its import threading import rarfile import os words = '0123456789abcdefghijklmnopqrstuvwxyz' # 涉及到生

  • 利用Python自动化操作AutoCAD的实现

    1 Python自动绘图 在这里我主要运用了pyautocad库进行AutoCAD的自动化操作,pyautocad是一款功能非常强大的AutoCAD操作处理库,可以实现Python自动绘图.CAD图像对象读取.对象属性修改等操作. from pyautocad import Autocad,APoint # 连接及库导入 acad = Autocad(create_if_not_exists = True) acad.prompt("Hello! Autocad from Python.&quo

随机推荐